Target
Tyrosine-protein phosphatase non-receptor type 22
Ligand
BDBM74498
Substrate
Meas. Tech.
Dose Response confirmation of uHTS hits from a small molecule inhibitors of LYP via a fluorescence intensity assay - Set 2
IC50
>79400±0 nM
Citation
 PubChem, PC Dose Response confirmation of uHTS hits from a small molecule inhibitors of LYP via a fluorescence intensity assay - Set 2 PubChem Bioassay (2010)[AID] 
Target
Name:
Tyrosine-protein phosphatase non-receptor type 22
Synonyms:
3.1.3.48 LyP Lymphoid phosphatase (Lyp) PEST-domain phosphatase PTPN22 Tyrosine-protein phosphatase non-receptor type 22 (LYP) | tyrosine-protein phosphatase non-receptor type 22 isoform 1
Type:
Mol. Mass.:
91712.31
Organism:
Homo sapiens (Human)
Description:
Q9Y2R2
Residue:
807
  
Inhibitor
Name:
BDBM74498
Synonyms:
2-(2-ethoxyphenyl)-N'-(4-hydroxy-3-methoxybenzylidene)-4-quinolinecarbohydrazide 2-(2-ethoxyphenyl)-N'-[(Z)-(3-methoxy-4-oxo-1-cyclohexa-2,5-dienylidene)methyl]-4-quinolinecarbohydrazide MLS000705000 SMR000231218 | cid_5432339
Type:
Small organic molecule
Emp. Form.:
C26H23N3O4
Mol. Mass.:
441.4785
SMILES:
CCOc1ccccc1-c1cc(C(=O)NN=Cc2ccc(O)c(OC)c2)c2ccccc2n1
: