Target
Tyrosine-protein phosphatase non-receptor type 22
Ligand
BDBM74499
Substrate
Meas. Tech.
Dose Response confirmation of uHTS hits from a small molecule inhibitors of LYP via a fluorescence intensity assay - Set 2
IC50
>79400±0 nM
Citation
 PubChem, PC Dose Response confirmation of uHTS hits from a small molecule inhibitors of LYP via a fluorescence intensity assay - Set 2 PubChem Bioassay (2010)[AID] 
Target
Name:
Tyrosine-protein phosphatase non-receptor type 22
Synonyms:
3.1.3.48 LyP Lymphoid phosphatase (Lyp) PEST-domain phosphatase PTPN22 Tyrosine-protein phosphatase non-receptor type 22 (LYP) | tyrosine-protein phosphatase non-receptor type 22 isoform 1
Type:
Mol. Mass.:
91712.31
Organism:
Homo sapiens (Human)
Description:
Q9Y2R2
Residue:
807
  
Inhibitor
Name:
BDBM74499
Synonyms:
4-chloro-N'-(2-methyl-3-furoyl)benzenesulfonohydrazide N'-(4-chlorophenyl)sulfonyl-2-methyl-3-furancarbohydrazide N'-(4-chlorophenyl)sulfonyl-2-methyl-furan-3-carbohydrazide SMR000230863 | cid_808086
Type:
Small organic molecule
Emp. Form.:
C12H11ClN2O4S
Mol. Mass.:
314.745
SMILES:
Cc1occc1C(=O)NNS(=O)(=O)c1ccc(Cl)cc1
: