Target
Tyrosine-protein phosphatase non-receptor type 22
Ligand
BDBM74508
Substrate
Meas. Tech.
Dose Response confirmation of uHTS hits from a small molecule inhibitors of LYP via a fluorescence intensity assay - Set 2
IC50
>79400±0 nM
Citation
 PubChem, PC Dose Response confirmation of uHTS hits from a small molecule inhibitors of LYP via a fluorescence intensity assay - Set 2 PubChem Bioassay (2010)[AID] 
Target
Name:
Tyrosine-protein phosphatase non-receptor type 22
Synonyms:
3.1.3.48 LyP Lymphoid phosphatase (Lyp) PEST-domain phosphatase PTPN22 Tyrosine-protein phosphatase non-receptor type 22 (LYP) | tyrosine-protein phosphatase non-receptor type 22 isoform 1
Type:
Mol. Mass.:
91712.31
Organism:
Homo sapiens (Human)
Description:
Q9Y2R2
Residue:
807
  
Inhibitor
Name:
BDBM74508
Synonyms:
3-(2-chlorophenyl)-5-methyl-N-[1-[3-(2-methylpropanoylamino)phenyl]ethylideneamino]-1,2-oxazole-4-carboxamide 3-(2-chlorophenyl)-N-[1-[3-(isobutyrylamino)phenyl]ethylideneamino]-5-methyl-isoxazole-4-carboxamide N-[3-(N-{[3-(2-chlorophenyl)-5-methyl-4-isoxazolyl]carbonyl}ethanehydrazonoyl)phenyl]-2-methylpropanamide cid_1223922
Type:
Small organic molecule
Emp. Form.:
C23H23ClN4O3
Mol. Mass.:
438.907
SMILES:
CC(C)C(=O)Nc1cccc(c1)C(C)=NNC(=O)c1c(C)onc1-c1ccccc1Cl
: