Target
Tyrosine-protein phosphatase non-receptor type 22
Ligand
BDBM74514
Substrate
Meas. Tech.
Dose Response confirmation of uHTS hits from a small molecule inhibitors of LYP via a fluorescence intensity assay - Set 2
IC50
>79400±0 nM
Citation
 PubChem, PC Dose Response confirmation of uHTS hits from a small molecule inhibitors of LYP via a fluorescence intensity assay - Set 2 PubChem Bioassay (2010)[AID] 
Target
Name:
Tyrosine-protein phosphatase non-receptor type 22
Synonyms:
3.1.3.48 LyP Lymphoid phosphatase (Lyp) PEST-domain phosphatase PTPN22 Tyrosine-protein phosphatase non-receptor type 22 (LYP) | tyrosine-protein phosphatase non-receptor type 22 isoform 1
Type:
Mol. Mass.:
91712.31
Organism:
Homo sapiens (Human)
Description:
Q9Y2R2
Residue:
807
  
Inhibitor
Name:
BDBM74514
Synonyms:
MLS000698179 N-[(1-ethyl-4-pyrazolyl)methyl]-4-methyl-3,5-dinitrobenzamide N-[(1-ethylpyrazol-4-yl)methyl]-4-methyl-3,5-dinitrobenzamide cid_7028277
Type:
Small organic molecule
Emp. Form.:
C14H15N5O5
Mol. Mass.:
333.2994
SMILES:
CCn1cc(CNC(=O)c2cc(c(C)c(c2)[N+]([O-])=O)[N+]([O-])=O)cn1
: