Target
Tyrosine-protein phosphatase non-receptor type 22
Ligand
BDBM74527
Substrate
Meas. Tech.
Dose Response confirmation of uHTS hits from a small molecule inhibitors of LYP via a fluorescence intensity assay - Set 2
IC50
>79400±0 nM
Citation
 PubChem, PC Dose Response confirmation of uHTS hits from a small molecule inhibitors of LYP via a fluorescence intensity assay - Set 2 PubChem Bioassay (2010)[AID] 
Target
Name:
Tyrosine-protein phosphatase non-receptor type 22
Synonyms:
3.1.3.48 LyP Lymphoid phosphatase (Lyp) PEST-domain phosphatase PTPN22 Tyrosine-protein phosphatase non-receptor type 22 (LYP) | tyrosine-protein phosphatase non-receptor type 22 isoform 1
Type:
Mol. Mass.:
91712.31
Organism:
Homo sapiens (Human)
Description:
Q9Y2R2
Residue:
807
  
Inhibitor
Name:
BDBM74527
Synonyms:
2-(4-acetamidophenyl)sulfanyl-N-(5-chloranylpyridin-2-yl)ethanamide 2-[(4-acetamidophenyl)thio]-N-(5-chloro-2-pyridinyl)acetamide MLS001007499 cid_2100279
Type:
Small organic molecule
Emp. Form.:
C15H14ClN3O2S
Mol. Mass.:
335.809
SMILES:
CC(=O)Nc1ccc(SCC(=O)Nc2ccc(Cl)cn2)cc1
: