Target
Tyrosine-protein phosphatase non-receptor type 22
Ligand
BDBM53315
Substrate
Meas. Tech.
Dose Response confirmation of uHTS hits from a small molecule inhibitors of LYP via a fluorescence intensity assay - Set 2
IC50
>79400±0 nM
Citation
 PubChem, PC Dose Response confirmation of uHTS hits from a small molecule inhibitors of LYP via a fluorescence intensity assay - Set 2 PubChem Bioassay (2010)[AID] 
Target
Name:
Tyrosine-protein phosphatase non-receptor type 22
Synonyms:
3.1.3.48 LyP Lymphoid phosphatase (Lyp) PEST-domain phosphatase PTPN22 Tyrosine-protein phosphatase non-receptor type 22 (LYP) | tyrosine-protein phosphatase non-receptor type 22 isoform 1
Type:
Mol. Mass.:
91712.31
Organism:
Homo sapiens (Human)
Description:
Q9Y2R2
Residue:
807
  
Inhibitor
Name:
BDBM53315
Synonyms:
2-azanylidene-3-(4-bromophenyl)sulfonyl-1-(2-methoxyethyl)dipyrido[1,2-d:3',4'-f]pyrimidin-5-one 3-(4-bromophenyl)sulfonyl-2-imino-1-(2-methoxyethyl)dipyrido[1,2-d:3',4'-f]pyrimidin-5-one MLS001141113 cid_4045115
Type:
Small organic molecule
Emp. Form.:
C20H17BrN4O4S
Mol. Mass.:
489.342
SMILES:
COCCn1c2nc3ccccn3c(=O)c2cc(c1=N)S(=O)(=O)c1ccc(Br)cc1
: