Target
Importin subunit alpha-1
Ligand
BDBM38385
Substrate
Meas. Tech.
Fluorescence Cell-Free Homogeneous Counterscreen to Identify Inhibitors of the RanGTP-Importin-beta complex.
EC50
>500000±n/a nM
Citation
 PubChem, PC Fluorescence Cell-Free Homogeneous Counterscreen to Identify Inhibitors of the RanGTP-Importin-beta complex. PubChem Bioassay (2010)[AID] 
Target
Name:
Importin subunit alpha-1
Synonyms:
IMA1_HUMAN RCH1 karyopherin alpha 2 (RAG cohort 1, importin alpha 1), isoform CRA_b
Type:
Enzyme Catalytic Domain
Mol. Mass.:
57852.15
Organism:
Homo sapiens (Human)
Description:
gi_119609447
Residue:
529
  
Inhibitor
Name:
BDBM38385
Synonyms:
MLS000045293 N-[4-(diethylsulfamoyl)phenyl]-2-(2-methoxyethyl)-3-oxo-1H-isoindole-4-carboxamide N-{4-[(diethylamino)sulfonyl]phenyl}-2-(2-methoxyethyl)-3-oxoisoindoline-4-carboxamide cid_3235931
Type:
Small organic molecule
Emp. Form.:
C22H27N3O5S
Mol. Mass.:
445.532
SMILES:
CCN(CC)S(=O)(=O)c1ccc(NC(=O)c2cccc3CN(CCOC)C(=O)c23)cc1
: