Target
Importin subunit alpha-1
Ligand
BDBM74626
Substrate
Meas. Tech.
Fluorescence Cell-Free Homogeneous Counterscreen to Identify Inhibitors of the RanGTP-Importin-beta complex.
EC50
>500000±n/a nM
Citation
 PubChem, PC Fluorescence Cell-Free Homogeneous Counterscreen to Identify Inhibitors of the RanGTP-Importin-beta complex. PubChem Bioassay (2010)[AID] 
Target
Name:
Importin subunit alpha-1
Synonyms:
IMA1_HUMAN RCH1 karyopherin alpha 2 (RAG cohort 1, importin alpha 1), isoform CRA_b
Type:
Enzyme Catalytic Domain
Mol. Mass.:
57852.15
Organism:
Homo sapiens (Human)
Description:
gi_119609447
Residue:
529
  
Inhibitor
Name:
BDBM74626
Synonyms:
3-cyclohexyl-6-[4-(phenylmethyl)-1-piperidinyl]-1H-pyrimidine-2,4-dione 6-(4-benzylpiperidin-1-yl)-3-cyclohexyl-1H-pyrimidine-2,4-dione 6-(4-benzylpiperidino)-3-cyclohexyl-uracil SMR000029963 | cid_3239085
Type:
Small organic molecule
Emp. Form.:
C22H29N3O2
Mol. Mass.:
367.4846
SMILES:
O=c1cc([nH]c(=O)n1C1CCCCC1)N1CCC(Cc2ccccc2)CC1
: