Target
Importin subunit alpha-1
Ligand
BDBM74655
Substrate
Meas. Tech.
Fluorescence Cell-Free Homogeneous Counterscreen to Identify Inhibitors of the RanGTP-Importin-beta complex.
EC50
>500000±n/a nM
Citation
 PubChem, PC Fluorescence Cell-Free Homogeneous Counterscreen to Identify Inhibitors of the RanGTP-Importin-beta complex. PubChem Bioassay (2010)[AID] 
Target
Name:
Importin subunit alpha-1
Synonyms:
IMA1_HUMAN RCH1 karyopherin alpha 2 (RAG cohort 1, importin alpha 1), isoform CRA_b
Type:
Enzyme Catalytic Domain
Mol. Mass.:
57852.15
Organism:
Homo sapiens (Human)
Description:
gi_119609447
Residue:
529
  
Inhibitor
Name:
BDBM74655
Synonyms:
4-tert-butyl-N-[2-[4-(2-furoyl)piperazino]-2-keto-ethyl]benzenesulfonamide 4-tert-butyl-N-[2-[4-(furan-2-ylcarbonyl)piperazin-1-yl]-2-oxidanylidene-ethyl]benzenesulfonamide 4-tert-butyl-N-{2-[4-(2-furoyl)-1-piperazinyl]-2-oxoethyl}benzenesulfonamide (non-preferred name) SMR000077516 | cid_984193
Type:
Small organic molecule
Emp. Form.:
C21H27N3O5S
Mol. Mass.:
433.521
SMILES:
CC(C)(C)c1ccc(cc1)S(=O)(=O)NCC(=O)N1CCN(CC1)C(=O)c1ccco1
: