Target
Importin subunit alpha-1
Ligand
BDBM64782
Substrate
Meas. Tech.
Fluorescence Cell-Free Homogeneous Counterscreen to Identify Inhibitors of the RanGTP-Importin-beta complex.
EC50
>500000±n/a nM
Citation
 PubChem, PC Fluorescence Cell-Free Homogeneous Counterscreen to Identify Inhibitors of the RanGTP-Importin-beta complex. PubChem Bioassay (2010)[AID] 
Target
Name:
Importin subunit alpha-1
Synonyms:
IMA1_HUMAN RCH1 karyopherin alpha 2 (RAG cohort 1, importin alpha 1), isoform CRA_b
Type:
Enzyme Catalytic Domain
Mol. Mass.:
57852.15
Organism:
Homo sapiens (Human)
Description:
gi_119609447
Residue:
529
  
Inhibitor
Name:
BDBM64782
Synonyms:
(6E)-6-[[2-(2,6-dipyrrolidin-1-ylpyrimidin-4-yl)hydrazinyl]methylidene]cyclohexa-2,4-dien-1-one (6E)-6-[[[2,6-bis(1-pyrrolidinyl)-4-pyrimidinyl]hydrazo]methylidene]-1-cyclohexa-2,4-dienone MLS000577672 cid_6614484
Type:
Small organic molecule
Emp. Form.:
C19H24N6O
Mol. Mass.:
352.4335
SMILES:
Oc1ccccc1CN=Nc1cc(nc(n1)N1CCCC1)N1CCCC1
: