Target
Tyrosine-protein phosphatase non-receptor type 22
Ligand
BDBM74451
Substrate
Meas. Tech.
Dose Response confirmation of uHTS hits from a small molecule inhibitors of LYP via a fluorescence intensity assay using pCAP substrate
IC50
>79400±n/a nM
Citation
 PubChem, PC Dose Response confirmation of uHTS hits from a small molecule inhibitors of LYP via a fluorescence intensity assay using pCAP substrate PubChem Bioassay (2010)[AID] 
Target
Name:
Tyrosine-protein phosphatase non-receptor type 22
Synonyms:
3.1.3.48 LyP Lymphoid phosphatase (Lyp) PEST-domain phosphatase PTPN22 Tyrosine-protein phosphatase non-receptor type 22 (LYP) | tyrosine-protein phosphatase non-receptor type 22 isoform 1
Type:
Mol. Mass.:
91712.31
Organism:
Homo sapiens (Human)
Description:
Q9Y2R2
Residue:
807
  
Inhibitor
Name:
BDBM74451
Synonyms:
(2S)-4-(methylthio)-2-[[3-(trifluoromethyl)phenyl]carbamoylamino]butyric acid (2S)-4-methylsulfanyl-2-[[3-(trifluoromethyl)phenyl]carbamoylamino]butanoic acid SMR000045649 | cid_664601
Type:
Small organic molecule
Emp. Form.:
C13H15F3N2O3S
Mol. Mass.:
336.33
SMILES:
CSCC[C@H](NC(=O)Nc1cccc(c1)C(F)(F)F)C(O)=O
: