Target
Tyrosine-protein phosphatase non-receptor type 22
Ligand
BDBM32061
Substrate
Meas. Tech.
Dose Response confirmation of uHTS hits from a small molecule inhibitors of LYP via a fluorescence intensity assay using pCAP substrate
IC50
>79400±n/a nM
Citation
 PubChem, PC Dose Response confirmation of uHTS hits from a small molecule inhibitors of LYP via a fluorescence intensity assay using pCAP substrate PubChem Bioassay (2010)[AID] 
Target
Name:
Tyrosine-protein phosphatase non-receptor type 22
Synonyms:
3.1.3.48 LyP Lymphoid phosphatase (Lyp) PEST-domain phosphatase PTPN22 Tyrosine-protein phosphatase non-receptor type 22 (LYP) | tyrosine-protein phosphatase non-receptor type 22 isoform 1
Type:
Mol. Mass.:
91712.31
Organism:
Homo sapiens (Human)
Description:
Q9Y2R2
Residue:
807
  
Inhibitor
Name:
BDBM32061
Synonyms:
1,8-bis(azanyl)-3,6-dipyrrolidin-1-yl-2,7-naphthyridine-4-carbonitrile 1,8-diamino-3,6-dipyrrolidin-1-yl-2,7-naphthyridine-4-carbonitrile MLS000054131 cid_2997948
Type:
Small organic molecule
Emp. Form.:
C17H21N7
Mol. Mass.:
323.3955
SMILES:
Nc1nc(cc2c(C#N)c(nc(N)c12)N1CCCC1)N1CCCC1
: