Target
Tyrosine-protein phosphatase non-receptor type 22
Ligand
BDBM74453
Substrate
Meas. Tech.
Dose Response confirmation of uHTS hits from a small molecule inhibitors of LYP via a fluorescence intensity assay using pCAP substrate
IC50
>79400±n/a nM
Citation
 PubChem, PC Dose Response confirmation of uHTS hits from a small molecule inhibitors of LYP via a fluorescence intensity assay using pCAP substrate PubChem Bioassay (2010)[AID] 
Target
Name:
Tyrosine-protein phosphatase non-receptor type 22
Synonyms:
3.1.3.48 LyP Lymphoid phosphatase (Lyp) PEST-domain phosphatase PTPN22 Tyrosine-protein phosphatase non-receptor type 22 (LYP) | tyrosine-protein phosphatase non-receptor type 22 isoform 1
Type:
Mol. Mass.:
91712.31
Organism:
Homo sapiens (Human)
Description:
Q9Y2R2
Residue:
807
  
Inhibitor
Name:
BDBM74453
Synonyms:
4-(7-methoxy-4-phenyl-2-quinolinyl)morpholine;oxalic acid 4-(7-methoxy-4-phenylquinolin-2-yl)morpholine;oxalic acid SMR000061969 ethanedioic acid;4-(7-methoxy-4-phenyl-quinolin-2-yl)morpholine
Type:
Small organic molecule
Emp. Form.:
C20H20N2O2
Mol. Mass.:
320.385
SMILES:
COc1ccc2c(cc(nc2c1)N1CCOCC1)-c1ccccc1
: