Target
Tyrosine-protein phosphatase non-receptor type 22
Ligand
BDBM37712
Substrate
Meas. Tech.
Dose Response confirmation of uHTS hits from a small molecule inhibitors of LYP via a fluorescence intensity assay using pCAP substrate
IC50
68933±n/a nM
Citation
 PubChem, PC Dose Response confirmation of uHTS hits from a small molecule inhibitors of LYP via a fluorescence intensity assay using pCAP substrate PubChem Bioassay (2010)[AID] 
Target
Name:
Tyrosine-protein phosphatase non-receptor type 22
Synonyms:
3.1.3.48 LyP Lymphoid phosphatase (Lyp) PEST-domain phosphatase PTPN22 Tyrosine-protein phosphatase non-receptor type 22 (LYP) | tyrosine-protein phosphatase non-receptor type 22 isoform 1
Type:
Mol. Mass.:
91712.31
Organism:
Homo sapiens (Human)
Description:
Q9Y2R2
Residue:
807
  
Inhibitor
Name:
BDBM37712
Synonyms:
4-{[3-(1,4-dioxa-8-azaspiro[4.5]dec-8-yl)-6-oxo-6H-anthra[1,9-cd]isoxazol-5-yl]amino}butanoic acid SMR000021906 | cid_3239469
Type:
Small organic molecule
Emp. Form.:
C25H25N3O6
Mol. Mass.:
463.4825
SMILES:
OC(=O)CCCNc1cc(N2CCC3(CC2)OCCO3)c2noc3-c4ccccc4C(=O)c1c23
: