Target
Tyrosine-protein phosphatase non-receptor type 22
Ligand
BDBM74456
Substrate
Meas. Tech.
Dose Response confirmation of uHTS hits from a small molecule inhibitors of LYP via a fluorescence intensity assay using pCAP substrate
IC50
>79400±n/a nM
Citation
 PubChem, PC Dose Response confirmation of uHTS hits from a small molecule inhibitors of LYP via a fluorescence intensity assay using pCAP substrate PubChem Bioassay (2010)[AID] 
Target
Name:
Tyrosine-protein phosphatase non-receptor type 22
Synonyms:
3.1.3.48 LyP Lymphoid phosphatase (Lyp) PEST-domain phosphatase PTPN22 Tyrosine-protein phosphatase non-receptor type 22 (LYP) | tyrosine-protein phosphatase non-receptor type 22 isoform 1
Type:
Mol. Mass.:
91712.31
Organism:
Homo sapiens (Human)
Description:
Q9Y2R2
Residue:
807
  
Inhibitor
Name:
BDBM74456
Synonyms:
5-methyl-N-[3-(2-oxidanylidenepyrrolidin-1-yl)propyl]thiophene-3-carboxamide 5-methyl-N-[3-(2-oxopyrrolidin-1-yl)propyl]thiophene-3-carboxamide N-[3-(2-ketopyrrolidino)propyl]-5-methyl-thiophene-3-carboxamide cid_2225281
Type:
Small organic molecule
Emp. Form.:
C13H18N2O2S
Mol. Mass.:
266.359
SMILES:
Cc1cc(cs1)C(=O)NCCCN1CCCC1=O
: