Target
Tyrosine-protein phosphatase non-receptor type 22
Ligand
BDBM74460
Substrate
Meas. Tech.
Dose Response confirmation of uHTS hits from a small molecule inhibitors of LYP via a fluorescence intensity assay using pCAP substrate
IC50
>79400±n/a nM
Citation
 PubChem, PC Dose Response confirmation of uHTS hits from a small molecule inhibitors of LYP via a fluorescence intensity assay using pCAP substrate PubChem Bioassay (2010)[AID] 
Target
Name:
Tyrosine-protein phosphatase non-receptor type 22
Synonyms:
3.1.3.48 LyP Lymphoid phosphatase (Lyp) PEST-domain phosphatase PTPN22 Tyrosine-protein phosphatase non-receptor type 22 (LYP) | tyrosine-protein phosphatase non-receptor type 22 isoform 1
Type:
Mol. Mass.:
91712.31
Organism:
Homo sapiens (Human)
Description:
Q9Y2R2
Residue:
807
  
Inhibitor
Name:
BDBM74460
Synonyms:
3a-methyl-4-phenyl-2,3,3a,4-tetrahydropyrrolo[1,2-a]quinazoline-1,5-dione 3a-methyl-4-phenyl-2,3-dihydropyrrolo[1,2-a]quinazoline-1,5-quinone SMR000081154 | cid_2973158
Type:
Small organic molecule
Emp. Form.:
C18H16N2O2
Mol. Mass.:
292.3318
SMILES:
CC12CCC(=O)N1c1ccccc1C(=O)N2c1ccccc1
: