Target
Tyrosine-protein phosphatase non-receptor type 22
Ligand
BDBM33642
Substrate
Meas. Tech.
Dose Response confirmation of uHTS hits from a small molecule inhibitors of LYP via a fluorescence intensity assay using pCAP substrate
IC50
>79400±n/a nM
Citation
 PubChem, PC Dose Response confirmation of uHTS hits from a small molecule inhibitors of LYP via a fluorescence intensity assay using pCAP substrate PubChem Bioassay (2010)[AID] 
Target
Name:
Tyrosine-protein phosphatase non-receptor type 22
Synonyms:
3.1.3.48 LyP Lymphoid phosphatase (Lyp) PEST-domain phosphatase PTPN22 Tyrosine-protein phosphatase non-receptor type 22 (LYP) | tyrosine-protein phosphatase non-receptor type 22 isoform 1
Type:
Mol. Mass.:
91712.31
Organism:
Homo sapiens (Human)
Description:
Q9Y2R2
Residue:
807
  
Inhibitor
Name:
BDBM33642
Synonyms:
MLS000527911 [3-(4-Chloro-phenyl)-5-methylsulfanyl-[1,2,4]triazol-1-yl]-furan-2-yl-methanone [3-(4-chlorophenyl)-5-(methylthio)-1,2,4-triazol-1-yl]-(2-furyl)methanone cid_828535
Type:
Small organic molecule
Emp. Form.:
C14H10ClN3O2S
Mol. Mass.:
319.766
SMILES:
CSc1nc(nn1C(=O)c1ccco1)-c1ccc(Cl)cc1
: