Target
Tyrosine-protein phosphatase non-receptor type 22
Ligand
BDBM74530
Substrate
Meas. Tech.
Dose Response confirmation of uHTS hits from a small molecule inhibitors of LYP via a fluorescence intensity assay using pCAP substrate
IC50
>79400±n/a nM
Citation
 PubChem, PC Dose Response confirmation of uHTS hits from a small molecule inhibitors of LYP via a fluorescence intensity assay using pCAP substrate PubChem Bioassay (2010)[AID] 
Target
Name:
Tyrosine-protein phosphatase non-receptor type 22
Synonyms:
3.1.3.48 LyP Lymphoid phosphatase (Lyp) PEST-domain phosphatase PTPN22 Tyrosine-protein phosphatase non-receptor type 22 (LYP) | tyrosine-protein phosphatase non-receptor type 22 isoform 1
Type:
Mol. Mass.:
91712.31
Organism:
Homo sapiens (Human)
Description:
Q9Y2R2
Residue:
807
  
Inhibitor
Name:
BDBM74530
Synonyms:
2-fluoro-N-(5-veratryl-1,3,4-thiadiazol-2-yl)benzamide N-[5-(3,4-Dimethoxy-benzyl)-[1,3,4]thiadiazol-2-yl]-2-fluoro-benzamide N-[5-[(3,4-dimethoxyphenyl)methyl]-1,3,4-thiadiazol-2-yl]-2-fluorobenzamide cid_1382247
Type:
Small organic molecule
Emp. Form.:
C18H16FN3O3S
Mol. Mass.:
373.401
SMILES:
COc1ccc(Cc2nnc(NC(=O)c3ccccc3F)s2)cc1OC
: