Target
Envelope glycoprotein gp160
Ligand
BDBM70226
Substrate
Meas. Tech.
SAR analysis of compounds that inhibit Human Immunodeficiency Virus Fusion, cell-cell fusion assay
IC50
10000±1100 nM
Citation
 PubChem, PC SAR analysis of compounds that inhibit Human Immunodeficiency Virus Fusion, cell-cell fusion assay PubChem Bioassay (2010)[AID] 
Target
Name:
Envelope glycoprotein gp160
Synonyms:
envelope glycoprotein
Type:
Enzyme Catalytic Domain
Mol. Mass.:
91798.58
Organism:
Human immunodeficiency virus 1
Description:
gi_45357394
Residue:
814
  
Inhibitor
Name:
BDBM70226
Synonyms:
2-chloranyl-5-[2-[(4-phenylphenyl)methylidene]hydrazinyl]benzoic acid 2-chloro-5-[N'-(4-phenylbenzylidene)hydrazino]benzoic acid cid_3288025
Type:
Small organic molecule
Emp. Form.:
C20H15ClN2O2
Mol. Mass.:
350.798
SMILES:
OC(=O)c1cc(ccc1Cl)N=NCc1ccc(cc1)-c1ccccc1
: