Target
Envelope glycoprotein gp160
Ligand
BDBM51781
Substrate
Meas. Tech.
SAR analysis of compounds that inhibit Human Immunodeficiency Virus Fusion, cell-cell fusion assay
IC50
20000±4500 nM
Citation
 PubChem, PC SAR analysis of compounds that inhibit Human Immunodeficiency Virus Fusion, cell-cell fusion assay PubChem Bioassay (2010)[AID] 
Target
Name:
Envelope glycoprotein gp160
Synonyms:
envelope glycoprotein
Type:
Enzyme Catalytic Domain
Mol. Mass.:
91798.58
Organism:
Human immunodeficiency virus 1
Description:
gi_45357394
Residue:
814
  
Inhibitor
Name:
BDBM51781
Synonyms:
(5E)-1-(4-fluorophenyl)-5-(2-furanylmethylidene)-2-sulfanylidene-1,3-diazinane-4,6-dione (5E)-1-(4-fluorophenyl)-5-(furan-2-ylmethylidene)-2-sulfanylidene-1,3-diazinane-4,6-dione MLS001211808 cid_777365
Type:
Small organic molecule
Emp. Form.:
C15H9FN2O3S
Mol. Mass.:
316.307
SMILES:
Fc1ccc(cc1)N1C(=S)NC(=O)C(=Cc2ccco2)C1=O
: