Target
Envelope glycoprotein gp160
Ligand
BDBM51785
Substrate
Meas. Tech.
SAR analysis of compounds that inhibit Human Immunodeficiency Virus Fusion, cell-cell fusion assay
IC50
15000±700 nM
Citation
 PubChem, PC SAR analysis of compounds that inhibit Human Immunodeficiency Virus Fusion, cell-cell fusion assay PubChem Bioassay (2010)[AID] 
Target
Name:
Envelope glycoprotein gp160
Synonyms:
envelope glycoprotein
Type:
Enzyme Catalytic Domain
Mol. Mass.:
91798.58
Organism:
Human immunodeficiency virus 1
Description:
gi_45357394
Residue:
814
  
Inhibitor
Name:
BDBM51785
Synonyms:
(5E)-1-(2,5-dimethoxyphenyl)-5-(2-furanylmethylidene)-2-sulfanylidene-1,3-diazinane-4,6-dione (5E)-1-(2,5-dimethoxyphenyl)-5-(2-furylmethylene)-2-thioxodihydropyrimidine-4,6(1H,5H)-dione MLS001197216 cid_1608674
Type:
Small organic molecule
Emp. Form.:
C17H14N2O5S
Mol. Mass.:
358.368
SMILES:
COc1ccc(OC)c(c1)N1C(=S)NC(=O)C(=Cc2ccco2)C1=O
: