Target
Envelope glycoprotein gp160
Ligand
BDBM70227
Substrate
Meas. Tech.
SAR analysis of compounds that inhibit Human Immunodeficiency Virus Fusion, cell-cell fusion assay
IC50
4700±500 nM
Citation
 PubChem, PC SAR analysis of compounds that inhibit Human Immunodeficiency Virus Fusion, cell-cell fusion assay PubChem Bioassay (2010)[AID] 
Target
Name:
Envelope glycoprotein gp160
Synonyms:
envelope glycoprotein
Type:
Enzyme Catalytic Domain
Mol. Mass.:
91798.58
Organism:
Human immunodeficiency virus 1
Description:
gi_45357394
Residue:
814
  
Inhibitor
Name:
BDBM70227
Synonyms:
(6Z)-5-azanylidene-6-[[1-(3,5-dimethylphenyl)pyrrol-2-yl]methylidene]-3-methylsulfonyl-[1,2,4]thiadiazolo[4,5-a]pyrimidin-7-one (6Z)-6-[[1-(3,5-dimethylphenyl)pyrrol-2-yl]methylene]-5-imino-3-mesyl-[1,2,4]thiadiazolo[4,5-a]pyrimidin-7-one MLS-0245844.0001 | cid_16194363
Type:
Small organic molecule
Emp. Form.:
C19H17N5O3S2
Mol. Mass.:
427.5
SMILES:
Cc1cc(C)cc(c1)-n1cccc1\C=C1/C(=O)N=C2SN=C(N2C1=N)S(C)(=O)=O
: