Target
Envelope glycoprotein gp160
Ligand
BDBM67356
Substrate
Meas. Tech.
SAR analysis of compounds that inhibit Human Immunodeficiency Virus Fusion, cell-cell fusion assay
IC50
>100000±0 nM
Citation
 PubChem, PC SAR analysis of compounds that inhibit Human Immunodeficiency Virus Fusion, cell-cell fusion assay PubChem Bioassay (2010)[AID] 
Target
Name:
Envelope glycoprotein gp160
Synonyms:
envelope glycoprotein
Type:
Enzyme Catalytic Domain
Mol. Mass.:
91798.58
Organism:
Human immunodeficiency virus 1
Description:
gi_45357394
Residue:
814
  
Inhibitor
Name:
BDBM67356
Synonyms:
2-[(2E)-2-(5-nitro-2-oxo-1,2-dihydro-3H-indol-3-ylidene)hydrazino]benzoic acid 2-[2-(5-nitro-2-oxidanylidene-indol-3-yl)hydrazinyl]benzoic acid 2-[N'-(2-keto-5-nitro-indol-3-yl)hydrazino]benzoic acid SMR000564048 | cid_5995507
Type:
Small organic molecule
Emp. Form.:
C15H10N4O5
Mol. Mass.:
326.2637
SMILES:
OC(=O)c1ccccc1N[NH+]=C1C(=O)[N-]c2ccc(cc12)[N+]([O-])=O
: