Target
Envelope glycoprotein gp160
Ligand
BDBM70232
Substrate
Meas. Tech.
SAR analysis of compounds that inhibit Human Immunodeficiency Virus Fusion, cell-cell fusion assay
IC50
11100±1300 nM
Citation
 PubChem, PC SAR analysis of compounds that inhibit Human Immunodeficiency Virus Fusion, cell-cell fusion assay PubChem Bioassay (2010)[AID] 
Target
Name:
Envelope glycoprotein gp160
Synonyms:
envelope glycoprotein
Type:
Enzyme Catalytic Domain
Mol. Mass.:
91798.58
Organism:
Human immunodeficiency virus 1
Description:
gi_45357394
Residue:
814
  
Inhibitor
Name:
BDBM70232
Synonyms:
8-N-[2-(4-chlorophenyl)ethyl]-5-oxo-3-N-propan-2-yl-1-sulfanylidene-4H-[1,3]thiazolo[3,4-a]quinazoline-3,8-dicarboxamide N'-[2-(4-chlorophenyl)ethyl]-N-isopropyl-5-keto-1-thioxo-4H-thiazolo[3,4-a]quinazoline-3,8-dicarboxamide N8-[2-(4-chlorophenyl)ethyl]-5-oxo-N3-propan-2-yl-1-sulfanylidene-4H-thiazolo[3,4-a]quinazoline-3,8-dicarboxamide | cid_3480867
Type:
Small organic molecule
Emp. Form.:
C23H21ClN4O3S2
Mol. Mass.:
501.021
SMILES:
CC(C)NC(=O)c1sc(=S)n2c1[nH]c(=O)c1ccc(cc21)C(=O)NCCc1ccc(Cl)cc1
: