Target
Envelope glycoprotein gp160
Ligand
BDBM61178
Substrate
Meas. Tech.
SAR analysis of compounds that inhibit Human Immunodeficiency Virus Fusion, cell-cell fusion assay
IC50
4450±550 nM
Citation
 PubChem, PC SAR analysis of compounds that inhibit Human Immunodeficiency Virus Fusion, cell-cell fusion assay PubChem Bioassay (2010)[AID] 
Target
Name:
Envelope glycoprotein gp160
Synonyms:
envelope glycoprotein
Type:
Enzyme Catalytic Domain
Mol. Mass.:
91798.58
Organism:
Human immunodeficiency virus 1
Description:
gi_45357394
Residue:
814
  
Inhibitor
Name:
BDBM61178
Synonyms:
2-[4-[[6-carbethoxy-5-(4-isopropoxyphenyl)-3-keto-7-methyl-5H-thiazolo[3,2-a]pyrimidin-2-ylidene]methyl]phenoxy]acetic acid 2-[4-[[6-ethoxycarbonyl-7-methyl-3-oxo-5-(4-propan-2-yloxyphenyl)-5H-[1,3]thiazolo[3,2-a]pyrimidin-2-ylidene]methyl]phenoxy]acetic acid MLS000704846 cid_4440333 | {4-[(6-(ethoxycarbonyl)-5-(4-isopropoxyphenyl)-7-methyl-3-oxo-5H-[1,3]thiazolo[3,2-a]pyrimidin-2(3H)-ylidene)methyl]phenoxy}acetic acid
Type:
Small organic molecule
Emp. Form.:
C28H28N2O7S
Mol. Mass.:
536.596
SMILES:
CCOC(=O)C1=C(C)N=c2sc(=Cc3ccc(OCC(O)=O)cc3)c(=O)n2C1c1ccc(OC(C)C)cc1
: