Target
Tyrosine-protein phosphatase non-receptor type 7
Ligand
BDBM37040
Substrate
Meas. Tech.
Dose Response confirmation of HTS hits from an HePTP Fluorescent Assay using OMFP substrate - Set 2
IC50
>79400±0 nM
Citation
 PubChem, PC Dose Response confirmation of HTS hits from an HePTP Fluorescent Assay using OMFP substrate - Set 2 PubChem Bioassay (2010)[AID] 
Target
Name:
Tyrosine-protein phosphatase non-receptor type 7
Synonyms:
He-PTP Hematopoietic protein-tyrosine phosphatase (HEPTP) PTPN7 Tyrosine-protein phosphatase non-receptor type 7 | Tyrosine-protein phosphatase non-receptor type 7 (HEPTP)
Type:
Protein
Mol. Mass.:
40530.79
Organism:
Homo sapiens (Human)
Description:
P35236
Residue:
360
  
Inhibitor
Name:
BDBM37040
Synonyms:
3-chloranyl-N-(5-chloranylpyridin-2-yl)-4-ethoxy-benzamide 3-chloro-N-(5-chloro-2-pyridyl)-4-ethoxy-benzamide MLS000089749 cid_3237354
Type:
Small organic molecule
Emp. Form.:
C14H12Cl2N2O2
Mol. Mass.:
311.163
SMILES:
CCOc1ccc(cc1Cl)C(=O)Nc1ccc(Cl)cn1
: