Target
Tyrosine-protein phosphatase non-receptor type 7
Ligand
BDBM74464
Substrate
Meas. Tech.
Dose Response confirmation of HTS hits from an HePTP Fluorescent Assay using OMFP substrate - Set 2
IC50
>79400±0 nM
Citation
 PubChem, PC Dose Response confirmation of HTS hits from an HePTP Fluorescent Assay using OMFP substrate - Set 2 PubChem Bioassay (2010)[AID] 
Target
Name:
Tyrosine-protein phosphatase non-receptor type 7
Synonyms:
He-PTP Hematopoietic protein-tyrosine phosphatase (HEPTP) PTPN7 Tyrosine-protein phosphatase non-receptor type 7 | Tyrosine-protein phosphatase non-receptor type 7 (HEPTP)
Type:
Protein
Mol. Mass.:
40530.79
Organism:
Homo sapiens (Human)
Description:
P35236
Residue:
360
  
Inhibitor
Name:
BDBM74464
Synonyms:
3-(5-chloro-1,3-diketo-3a,4,7,7a-tetrahydroisoindol-2-yl)-N-(2-furfuryl)propionamide 3-(5-chloro-1,3-dioxo-3a,4,7,7a-tetrahydroisoindol-2-yl)-N-(2-furanylmethyl)propanamide 3-[5-chloranyl-1,3-bis(oxidanylidene)-3a,4,7,7a-tetrahydroisoindol-2-yl]-N-(furan-2-ylmethyl)propanamide SMR000070990 | cid_2900724
Type:
Small organic molecule
Emp. Form.:
C16H17ClN2O4
Mol. Mass.:
336.77
SMILES:
ClC1=CCC2C(C1)C(=O)N(CCC(=O)NCc1ccco1)C2=O
: