Target
Tyrosine-protein phosphatase non-receptor type 7
Ligand
BDBM74465
Substrate
Meas. Tech.
Dose Response confirmation of HTS hits from an HePTP Fluorescent Assay using OMFP substrate - Set 2
IC50
>79400±0 nM
Citation
 PubChem, PC Dose Response confirmation of HTS hits from an HePTP Fluorescent Assay using OMFP substrate - Set 2 PubChem Bioassay (2010)[AID] 
Target
Name:
Tyrosine-protein phosphatase non-receptor type 7
Synonyms:
He-PTP Hematopoietic protein-tyrosine phosphatase (HEPTP) PTPN7 Tyrosine-protein phosphatase non-receptor type 7 | Tyrosine-protein phosphatase non-receptor type 7 (HEPTP)
Type:
Protein
Mol. Mass.:
40530.79
Organism:
Homo sapiens (Human)
Description:
P35236
Residue:
360
  
Inhibitor
Name:
BDBM74465
Synonyms:
2-chloranyl-N-ethyl-5-methylsulfonyl-benzenesulfonamide 2-chloro-N-ethyl-5-mesyl-benzenesulfonamide MLS000066531 cid_847864
Type:
Small organic molecule
Emp. Form.:
C9H12ClNO4S2
Mol. Mass.:
297.779
SMILES:
CCNS(=O)(=O)c1cc(ccc1Cl)S(C)(=O)=O
: