Target
Tyrosine-protein phosphatase non-receptor type 7
Ligand
BDBM74482
Substrate
Meas. Tech.
Dose Response confirmation of HTS hits from an HePTP Fluorescent Assay using OMFP substrate - Set 2
IC50
>79400±0 nM
Citation
 PubChem, PC Dose Response confirmation of HTS hits from an HePTP Fluorescent Assay using OMFP substrate - Set 2 PubChem Bioassay (2010)[AID] 
Target
Name:
Tyrosine-protein phosphatase non-receptor type 7
Synonyms:
He-PTP Hematopoietic protein-tyrosine phosphatase (HEPTP) PTPN7 Tyrosine-protein phosphatase non-receptor type 7 | Tyrosine-protein phosphatase non-receptor type 7 (HEPTP)
Type:
Protein
Mol. Mass.:
40530.79
Organism:
Homo sapiens (Human)
Description:
P35236
Residue:
360
  
Inhibitor
Name:
BDBM74482
Synonyms:
2-[[4-(acetylsulfamoyl)anilino]-oxomethyl]-3-bicyclo[2.2.1]hept-5-enecarboxylic acid 2-[[4-(ethanoylsulfamoyl)phenyl]carbamoyl]bicyclo[2.2.1]hept-5-ene-3-carboxylic acid MLS000705429 cid_3679306
Type:
Small organic molecule
Emp. Form.:
C17H18N2O6S
Mol. Mass.:
378.4
SMILES:
[H]C12CC([H])(C=C1)C(C2C(O)=O)C(=O)Nc1ccc(cc1)S(=O)(=O)NC(C)=O
: