Target
Tyrosine-protein phosphatase non-receptor type 7
Ligand
BDBM74494
Substrate
Meas. Tech.
Dose Response confirmation of HTS hits from an HePTP Fluorescent Assay using OMFP substrate - Set 2
IC50
>79400±0 nM
Citation
 PubChem, PC Dose Response confirmation of HTS hits from an HePTP Fluorescent Assay using OMFP substrate - Set 2 PubChem Bioassay (2010)[AID] 
Target
Name:
Tyrosine-protein phosphatase non-receptor type 7
Synonyms:
He-PTP Hematopoietic protein-tyrosine phosphatase (HEPTP) PTPN7 Tyrosine-protein phosphatase non-receptor type 7 | Tyrosine-protein phosphatase non-receptor type 7 (HEPTP)
Type:
Protein
Mol. Mass.:
40530.79
Organism:
Homo sapiens (Human)
Description:
P35236
Residue:
360
  
Inhibitor
Name:
BDBM74494
Synonyms:
2-phenyl-5-(2-thienyl)pyrazole-3-carboxylic acid [2-keto-2-(4-methyl-3-nitro-anilino)ethyl] ester MLS000375423 [2-(4-methyl-3-nitroanilino)-2-oxoethyl] 2-phenyl-5-thiophen-2-ylpyrazole-3-carboxylate cid_2449636
Type:
Small organic molecule
Emp. Form.:
C23H18N4O5S
Mol. Mass.:
462.478
SMILES:
Cc1ccc(NC(=O)COC(=O)c2cc(nn2-c2ccccc2)-c2cccs2)cc1[N+]([O-])=O
: