Target
Tyrosine-protein phosphatase non-receptor type 7
Ligand
BDBM74512
Substrate
Meas. Tech.
Dose Response confirmation of HTS hits from an HePTP Fluorescent Assay using OMFP substrate - Set 2
IC50
>79400±0 nM
Citation
 PubChem, PC Dose Response confirmation of HTS hits from an HePTP Fluorescent Assay using OMFP substrate - Set 2 PubChem Bioassay (2010)[AID] 
Target
Name:
Tyrosine-protein phosphatase non-receptor type 7
Synonyms:
He-PTP Hematopoietic protein-tyrosine phosphatase (HEPTP) PTPN7 Tyrosine-protein phosphatase non-receptor type 7 | Tyrosine-protein phosphatase non-receptor type 7 (HEPTP)
Type:
Protein
Mol. Mass.:
40530.79
Organism:
Homo sapiens (Human)
Description:
P35236
Residue:
360
  
Inhibitor
Name:
BDBM74512
Synonyms:
4-[(3-nitrobenzylidene)amino]-spiro[4-azatricyclo[5.2.1.0~2,6~]dec[8]ene-10,1'-cyclopropane]-3,5-dione SMR000225770 | cid_2855283
Type:
Small organic molecule
Emp. Form.:
C18H15N3O4
Mol. Mass.:
337.3294
SMILES:
[H]C12C=CC([H])(C3C1C(=O)N(N=Cc1cccc(c1)[N+]([O-])=O)C3=O)C21CC1
: