Target
Tyrosine-protein phosphatase non-receptor type 7
Ligand
BDBM60074
Substrate
Meas. Tech.
Dose Response confirmation of HTS hits from an HePTP Fluorescent Assay using OMFP substrate - Set 2
IC50
>79400±0 nM
Citation
 PubChem, PC Dose Response confirmation of HTS hits from an HePTP Fluorescent Assay using OMFP substrate - Set 2 PubChem Bioassay (2010)[AID] 
Target
Name:
Tyrosine-protein phosphatase non-receptor type 7
Synonyms:
He-PTP Hematopoietic protein-tyrosine phosphatase (HEPTP) PTPN7 Tyrosine-protein phosphatase non-receptor type 7 | Tyrosine-protein phosphatase non-receptor type 7 (HEPTP)
Type:
Protein
Mol. Mass.:
40530.79
Organism:
Homo sapiens (Human)
Description:
P35236
Residue:
360
  
Inhibitor
Name:
BDBM60074
Synonyms:
2-[(3,4-difluoroanilino)-oxomethyl]-1-cyclohexanecarboxylic acid 2-[(3,4-difluorophenyl)carbamoyl]cyclohexane-1-carboxylic acid 2-[[3,4-bis(fluoranyl)phenyl]carbamoyl]cyclohexane-1-carboxylic acid SMR000231199 | cid_4054405
Type:
Small organic molecule
Emp. Form.:
C14H15F2NO3
Mol. Mass.:
283.2706
SMILES:
OC(=O)C1CCCCC1C(=O)Nc1ccc(F)c(F)c1
: