Target
Tyrosine-protein phosphatase non-receptor type 7
Ligand
BDBM74517
Substrate
Meas. Tech.
Dose Response confirmation of HTS hits from an HePTP Fluorescent Assay using OMFP substrate - Set 2
IC50
>79400±0 nM
Citation
 PubChem, PC Dose Response confirmation of HTS hits from an HePTP Fluorescent Assay using OMFP substrate - Set 2 PubChem Bioassay (2010)[AID] 
Target
Name:
Tyrosine-protein phosphatase non-receptor type 7
Synonyms:
He-PTP Hematopoietic protein-tyrosine phosphatase (HEPTP) PTPN7 Tyrosine-protein phosphatase non-receptor type 7 | Tyrosine-protein phosphatase non-receptor type 7 (HEPTP)
Type:
Protein
Mol. Mass.:
40530.79
Organism:
Homo sapiens (Human)
Description:
P35236
Residue:
360
  
Inhibitor
Name:
BDBM74517
Synonyms:
1-{[3-(3-fluorophenyl)-1-(3-methylphenyl)-1H-pyrazol-4-yl]methyl}-4-(1H-1,2,4-triazol-3-ylcarbonyl)piperazine SMR000315953 [4-[[3-(3-fluorophenyl)-1-(3-methylphenyl)pyrazol-4-yl]methyl]piperazin-1-yl]-(1H-1,2,4-triazol-5-yl)methanone cid_16188415
Type:
Small organic molecule
Emp. Form.:
C24H24FN7O
Mol. Mass.:
445.4921
SMILES:
Cc1cccc(c1)-n1cc(CN2CCN(CC2)C(=O)c2nnc[nH]2)c(n1)-c1cccc(F)c1
: