Target
Tyrosine-protein phosphatase non-receptor type 7
Ligand
BDBM74520
Substrate
Meas. Tech.
Dose Response confirmation of HTS hits from an HePTP Fluorescent Assay using OMFP substrate - Set 2
IC50
>79400±0 nM
Citation
 PubChem, PC Dose Response confirmation of HTS hits from an HePTP Fluorescent Assay using OMFP substrate - Set 2 PubChem Bioassay (2010)[AID] 
Target
Name:
Tyrosine-protein phosphatase non-receptor type 7
Synonyms:
He-PTP Hematopoietic protein-tyrosine phosphatase (HEPTP) PTPN7 Tyrosine-protein phosphatase non-receptor type 7 | Tyrosine-protein phosphatase non-receptor type 7 (HEPTP)
Type:
Protein
Mol. Mass.:
40530.79
Organism:
Homo sapiens (Human)
Description:
P35236
Residue:
360
  
Inhibitor
Name:
BDBM74520
Synonyms:
MLS000692788 N-(2-furfuryl)quinaldamide SMR000285202 | cid_566063
Type:
Small organic molecule
Emp. Form.:
C15H12N2O2
Mol. Mass.:
252.268
SMILES:
O=C(NCc1ccco1)c1ccc2ccccc2n1
: