Target
Tyrosine-protein phosphatase non-receptor type 7
Ligand
BDBM74524
Substrate
Meas. Tech.
Dose Response confirmation of HTS hits from an HePTP Fluorescent Assay using OMFP substrate - Set 2
IC50
>79400±0 nM
Citation
 PubChem, PC Dose Response confirmation of HTS hits from an HePTP Fluorescent Assay using OMFP substrate - Set 2 PubChem Bioassay (2010)[AID] 
Target
Name:
Tyrosine-protein phosphatase non-receptor type 7
Synonyms:
He-PTP Hematopoietic protein-tyrosine phosphatase (HEPTP) PTPN7 Tyrosine-protein phosphatase non-receptor type 7 | Tyrosine-protein phosphatase non-receptor type 7 (HEPTP)
Type:
Protein
Mol. Mass.:
40530.79
Organism:
Homo sapiens (Human)
Description:
P35236
Residue:
360
  
Inhibitor
Name:
BDBM74524
Synonyms:
MLS000718007 N-(4-chlorophenyl)-4-(thietan-3-yloxy)benzamide cid_2874345
Type:
Small organic molecule
Emp. Form.:
C16H14ClNO2S
Mol. Mass.:
319.806
SMILES:
Clc1ccc(NC(=O)c2ccc(OC3CSC3)cc2)cc1
: