Target
Tyrosine-protein phosphatase non-receptor type 7
Ligand
BDBM53315
Substrate
Meas. Tech.
Dose Response confirmation of HTS hits from an HePTP Fluorescent Assay using OMFP substrate - Set 2
IC50
>79400±0 nM
Citation
 PubChem, PC Dose Response confirmation of HTS hits from an HePTP Fluorescent Assay using OMFP substrate - Set 2 PubChem Bioassay (2010)[AID] 
Target
Name:
Tyrosine-protein phosphatase non-receptor type 7
Synonyms:
He-PTP Hematopoietic protein-tyrosine phosphatase (HEPTP) PTPN7 Tyrosine-protein phosphatase non-receptor type 7 | Tyrosine-protein phosphatase non-receptor type 7 (HEPTP)
Type:
Protein
Mol. Mass.:
40530.79
Organism:
Homo sapiens (Human)
Description:
P35236
Residue:
360
  
Inhibitor
Name:
BDBM53315
Synonyms:
2-azanylidene-3-(4-bromophenyl)sulfonyl-1-(2-methoxyethyl)dipyrido[1,2-d:3',4'-f]pyrimidin-5-one 3-(4-bromophenyl)sulfonyl-2-imino-1-(2-methoxyethyl)dipyrido[1,2-d:3',4'-f]pyrimidin-5-one MLS001141113 cid_4045115
Type:
Small organic molecule
Emp. Form.:
C20H17BrN4O4S
Mol. Mass.:
489.342
SMILES:
COCCn1c2nc3ccccn3c(=O)c2cc(c1=N)S(=O)(=O)c1ccc(Br)cc1
: