Target
Tyrosine-protein phosphatase non-receptor type 22
Ligand
BDBM46271
Substrate
Meas. Tech.
SAR LYP1 Fluorescent Assay using OMFP substrate for In Vitro dose response studies - Set 3
IC50
74800±n/a nM
Citation
 PubChem, PC SAR LYP1 Fluorescent Assay using OMFP substrate for In Vitro dose response studies - Set 3 PubChem Bioassay (2010)[AID] 
Target
Name:
Tyrosine-protein phosphatase non-receptor type 22
Synonyms:
3.1.3.48 LyP Lymphoid phosphatase (Lyp) PEST-domain phosphatase PTPN22 Tyrosine-protein phosphatase non-receptor type 22 (LYP) | tyrosine-protein phosphatase non-receptor type 22 isoform 1
Type:
Mol. Mass.:
91712.31
Organism:
Homo sapiens (Human)
Description:
Q9Y2R2
Residue:
807
  
Inhibitor
Name:
BDBM46271
Synonyms:
2-[2-chloro-6-ethoxy-4-[(E)-[2-(4-fluoroanilino)-4-keto-2-thiazolin-5-ylidene]methyl]phenoxy]acetic acid ethyl ester MLS-0425586.0001 ethyl 2-[2-chloranyl-6-ethoxy-4-[(E)-[2-[(4-fluorophenyl)amino]-4-oxidanylidene-1,3-thiazol-5-ylidene]methyl]phenoxy]ethanoate | ethyl 2-[2-chloro-6-ethoxy-4-[(E)-[2-(4-fluoroanilino)-4-oxo-1,3-thiazol-5-ylidene]methyl]phenoxy]acetate
Type:
Small organic molecule
Emp. Form.:
C22H20ClFN2O5S
Mol. Mass.:
478.921
SMILES:
CCOC(=O)COc1c(Cl)cc(C=C2SC(Nc3ccc(F)cc3)=NC2=O)cc1OCC
: