Target
Tyrosine-protein phosphatase non-receptor type 22
Ligand
BDBM46276
Substrate
Meas. Tech.
SAR LYP1 Fluorescent Assay using OMFP substrate for In Vitro dose response studies - Set 3
IC50
44600±n/a nM
Citation
 PubChem, PC SAR LYP1 Fluorescent Assay using OMFP substrate for In Vitro dose response studies - Set 3 PubChem Bioassay (2010)[AID] 
Target
Name:
Tyrosine-protein phosphatase non-receptor type 22
Synonyms:
3.1.3.48 LyP Lymphoid phosphatase (Lyp) PEST-domain phosphatase PTPN22 Tyrosine-protein phosphatase non-receptor type 22 (LYP) | tyrosine-protein phosphatase non-receptor type 22 isoform 1
Type:
Mol. Mass.:
91712.31
Organism:
Homo sapiens (Human)
Description:
Q9Y2R2
Residue:
807
  
Inhibitor
Name:
BDBM46276
Synonyms:
2-[2,6-bis(chloranyl)-4-[(Z)-[6-ethoxycarbonyl-5-(3-methoxyphenyl)-7-methyl-3-oxidanylidene-5H-[1,3]thiazolo[3,2-a]pyrimidin-2-ylidene]methyl]phenoxy]ethanoic acid 2-[2,6-dichloro-4-[(Z)-[6-ethoxycarbonyl-5-(3-methoxyphenyl)-7-methyl-3-oxo-5H-thiazolo[3,2-a]pyrimidin-2-ylidene]methyl]phenoxy]acetic acid MLS-0425590.0001 | cid_6000533
Type:
Small organic molecule
Emp. Form.:
C26H22Cl2N2O7S
Mol. Mass.:
577.433
SMILES:
CCOC(=O)C1=C(C)N=c2s\c(=C/c3cc(Cl)c(OCC(O)=O)c(Cl)c3)c(=O)n2C1c1cccc(OC)c1
: