Target
Tyrosine-protein phosphatase non-receptor type 22
Ligand
BDBM65962
Substrate
Meas. Tech.
SAR LYP1 Fluorescent Assay using OMFP substrate for In Vitro dose response studies - Set 3
IC50
>100000±n/a nM
Citation
 PubChem, PC SAR LYP1 Fluorescent Assay using OMFP substrate for In Vitro dose response studies - Set 3 PubChem Bioassay (2010)[AID] 
Target
Name:
Tyrosine-protein phosphatase non-receptor type 22
Synonyms:
3.1.3.48 LyP Lymphoid phosphatase (Lyp) PEST-domain phosphatase PTPN22 Tyrosine-protein phosphatase non-receptor type 22 (LYP) | tyrosine-protein phosphatase non-receptor type 22 isoform 1
Type:
Mol. Mass.:
91712.31
Organism:
Homo sapiens (Human)
Description:
Q9Y2R2
Residue:
807
  
Inhibitor
Name:
BDBM65962
Synonyms:
4-[2-(4-chloroanilino)-1,3-thiazol-4-yl]-N'-[(4-oxocyclohexa-2,5-dien-1-ylidene)methyl]benzohydrazide 4-[2-(4-chloroanilino)thiazol-4-yl]-N'-[(4-ketocyclohexa-2,5-dien-1-ylidene)methyl]benzohydrazide MLS-0435412.0001 | cid_5766948
Type:
Small organic molecule
Emp. Form.:
C23H17ClN4O2S
Mol. Mass.:
448.925
SMILES:
Oc1ccc(C=NNC(=O)c2ccc(cc2)-c2csc(Nc3ccc(Cl)cc3)n2)cc1
: