Target
Tyrosine-protein phosphatase non-receptor type 22
Ligand
BDBM63615
Substrate
Meas. Tech.
SAR LYP1 Fluorescent Assay using OMFP substrate for In Vitro dose response studies - Set 3
IC50
>100000±n/a nM
Citation
 PubChem, PC SAR LYP1 Fluorescent Assay using OMFP substrate for In Vitro dose response studies - Set 3 PubChem Bioassay (2010)[AID] 
Target
Name:
Tyrosine-protein phosphatase non-receptor type 22
Synonyms:
3.1.3.48 LyP Lymphoid phosphatase (Lyp) PEST-domain phosphatase PTPN22 Tyrosine-protein phosphatase non-receptor type 22 (LYP) | tyrosine-protein phosphatase non-receptor type 22 isoform 1
Type:
Mol. Mass.:
91712.31
Organism:
Homo sapiens (Human)
Description:
Q9Y2R2
Residue:
807
  
Inhibitor
Name:
BDBM63615
Synonyms:
2-[4-[[(2-bromobenzoyl)hydrazinylidene]methyl]phenoxy]acetic acid 2-[4-[[(2-bromophenyl)carbonylhydrazinylidene]methyl]phenoxy]ethanoic acid 2-{4-[2-(2-bromobenzoyl)carbohydrazonoyl]phenoxy}acetic acid SMR000338537 | cid_1280296
Type:
Small organic molecule
Emp. Form.:
C16H13BrN2O4
Mol. Mass.:
377.189
SMILES:
OC(=O)COc1ccc(C=NNC(=O)c2ccccc2Br)cc1
: