Target
Tyrosine-protein phosphatase non-receptor type 22
Ligand
BDBM61650
Substrate
Meas. Tech.
SAR LYP1 Fluorescent Assay using OMFP substrate for In Vitro dose response studies - Set 3
IC50
91400±n/a nM
Citation
 PubChem, PC SAR LYP1 Fluorescent Assay using OMFP substrate for In Vitro dose response studies - Set 3 PubChem Bioassay (2010)[AID] 
Target
Name:
Tyrosine-protein phosphatase non-receptor type 22
Synonyms:
3.1.3.48 LyP Lymphoid phosphatase (Lyp) PEST-domain phosphatase PTPN22 Tyrosine-protein phosphatase non-receptor type 22 (LYP) | tyrosine-protein phosphatase non-receptor type 22 isoform 1
Type:
Mol. Mass.:
91712.31
Organism:
Homo sapiens (Human)
Description:
Q9Y2R2
Residue:
807
  
Inhibitor
Name:
BDBM61650
Synonyms:
4-[4-[(5Z)-4-keto-5-piperonylidene-2-thioxo-thiazolidin-3-yl]butanoylamino]benzoic acid 4-[4-[(5Z)-5-(1,3-benzodioxol-5-ylmethylidene)-4-oxo-2-sulfanylidene-1,3-thiazolidin-3-yl]butanoylamino]benzoic acid MLS001083039 cid_2269231
Type:
Small organic molecule
Emp. Form.:
C22H18N2O6S2
Mol. Mass.:
470.518
SMILES:
OC(=O)c1ccc(NC(=O)CCCN2C(=S)S\C(=C/c3ccc4OCOc4c3)C2=O)cc1
: