Target
Tyrosine-protein phosphatase non-receptor type 22
Ligand
BDBM65975
Substrate
Meas. Tech.
SAR LYP1 Fluorescent Assay using OMFP substrate for In Vitro dose response studies - Set 3
IC50
62800±n/a nM
Citation
 PubChem, PC SAR LYP1 Fluorescent Assay using OMFP substrate for In Vitro dose response studies - Set 3 PubChem Bioassay (2010)[AID] 
Target
Name:
Tyrosine-protein phosphatase non-receptor type 22
Synonyms:
3.1.3.48 LyP Lymphoid phosphatase (Lyp) PEST-domain phosphatase PTPN22 Tyrosine-protein phosphatase non-receptor type 22 (LYP) | tyrosine-protein phosphatase non-receptor type 22 isoform 1
Type:
Mol. Mass.:
91712.31
Organism:
Homo sapiens (Human)
Description:
Q9Y2R2
Residue:
807
  
Inhibitor
Name:
BDBM65975
Synonyms:
3-[[4-[(E)-[3-(3-carboxyphenyl)-4-keto-2-thioxo-thiazolidin-5-ylidene]methyl]-2-chloro-6-methoxy-phenoxy]methyl]benzoic acid 3-[[4-[(E)-[3-(3-carboxyphenyl)-4-oxo-2-sulfanylidene-1,3-thiazolidin-5-ylidene]methyl]-2-chloro-6-methoxyphenoxy]methyl]benzoic acid MLS-0435626.0001 | cid_16466042
Type:
Small organic molecule
Emp. Form.:
C26H18ClNO7S2
Mol. Mass.:
556.007
SMILES:
COc1cc(\C=C2\SC(=S)N(C2=O)c2cccc(c2)C(O)=O)cc(Cl)c1OCc1cccc(c1)C(O)=O
: