Target
Tyrosine-protein phosphatase non-receptor type 22
Ligand
BDBM46219
Substrate
Meas. Tech.
SAR LYP1 Fluorescent Assay using pCAP substrate for In Vitro dose response studies - Set 3
IC50
>100000±n/a nM
Citation
 PubChem, PC SAR LYP1 Fluorescent Assay using pCAP substrate for In Vitro dose response studies - Set 3 PubChem Bioassay (2010)[AID] 
Target
Name:
Tyrosine-protein phosphatase non-receptor type 22
Synonyms:
3.1.3.48 LyP Lymphoid phosphatase (Lyp) PEST-domain phosphatase PTPN22 Tyrosine-protein phosphatase non-receptor type 22 (LYP) | tyrosine-protein phosphatase non-receptor type 22 isoform 1
Type:
Mol. Mass.:
91712.31
Organism:
Homo sapiens (Human)
Description:
Q9Y2R2
Residue:
807
  
Inhibitor
Name:
BDBM46219
Synonyms:
2-(3-methyl-4-methylsulfinyl-phenoxy)acetic acid 2-(3-methyl-4-methylsulfinylphenoxy)acetic acid cid_823136
Type:
Small organic molecule
Emp. Form.:
C10H12O4S
Mol. Mass.:
228.265
SMILES:
Cc1cc(OCC(O)=O)ccc1S(C)=O
: