Target
Tyrosine-protein phosphatase non-receptor type 22
Ligand
BDBM46273
Substrate
Meas. Tech.
SAR LYP1 Fluorescent Assay using pCAP substrate for In Vitro dose response studies - Set 3
IC50
12300±n/a nM
Citation
 PubChem, PC SAR LYP1 Fluorescent Assay using pCAP substrate for In Vitro dose response studies - Set 3 PubChem Bioassay (2010)[AID] 
Target
Name:
Tyrosine-protein phosphatase non-receptor type 22
Synonyms:
3.1.3.48 LyP Lymphoid phosphatase (Lyp) PEST-domain phosphatase PTPN22 Tyrosine-protein phosphatase non-receptor type 22 (LYP) | tyrosine-protein phosphatase non-receptor type 22 isoform 1
Type:
Mol. Mass.:
91712.31
Organism:
Homo sapiens (Human)
Description:
Q9Y2R2
Residue:
807
  
Inhibitor
Name:
BDBM46273
Synonyms:
2-[2-chloranyl-6-ethoxy-4-[(E)-[2-(naphthalen-2-ylamino)-4-oxidanylidene-1,3-thiazol-5-ylidene]methyl]phenoxy]ethanoic acid 2-[2-chloro-6-ethoxy-4-[(E)-[2-(naphthalen-2-ylamino)-4-oxo-1,3-thiazol-5-ylidene]methyl]phenoxy]acetic acid MLS-0425588.0001 | cid_1228861
Type:
Small organic molecule
Emp. Form.:
C24H19ClN2O5S
Mol. Mass.:
482.936
SMILES:
CCOc1cc(C=C2SC(Nc3ccc4ccccc4c3)=NC2=O)cc(Cl)c1OCC(O)=O
: