Target
Tyrosine-protein phosphatase non-receptor type 22
Ligand
BDBM65969
Substrate
Meas. Tech.
SAR LYP1 Fluorescent Assay using pCAP substrate for In Vitro dose response studies - Set 3
IC50
>100000±n/a nM
Citation
 PubChem, PC SAR LYP1 Fluorescent Assay using pCAP substrate for In Vitro dose response studies - Set 3 PubChem Bioassay (2010)[AID] 
Target
Name:
Tyrosine-protein phosphatase non-receptor type 22
Synonyms:
3.1.3.48 LyP Lymphoid phosphatase (Lyp) PEST-domain phosphatase PTPN22 Tyrosine-protein phosphatase non-receptor type 22 (LYP) | tyrosine-protein phosphatase non-receptor type 22 isoform 1
Type:
Mol. Mass.:
91712.31
Organism:
Homo sapiens (Human)
Description:
Q9Y2R2
Residue:
807
  
Inhibitor
Name:
BDBM65969
Synonyms:
2-(4-anilinophenoxy)acetic acid MLS-0258798.0001 | cid_2396472
Type:
Small organic molecule
Emp. Form.:
C14H13NO3
Mol. Mass.:
243.2579
SMILES:
OC(=O)COc1ccc(Nc2ccccc2)cc1
: