Target
Tyrosine-protein phosphatase non-receptor type 22
Ligand
BDBM61645
Substrate
Meas. Tech.
SAR LYP1 Fluorescent Assay using pCAP substrate for In Vitro dose response studies - Set 3
IC50
72600±n/a nM
Citation
 PubChem, PC SAR LYP1 Fluorescent Assay using pCAP substrate for In Vitro dose response studies - Set 3 PubChem Bioassay (2010)[AID] 
Target
Name:
Tyrosine-protein phosphatase non-receptor type 22
Synonyms:
3.1.3.48 LyP Lymphoid phosphatase (Lyp) PEST-domain phosphatase PTPN22 Tyrosine-protein phosphatase non-receptor type 22 (LYP) | tyrosine-protein phosphatase non-receptor type 22 isoform 1
Type:
Mol. Mass.:
91712.31
Organism:
Homo sapiens (Human)
Description:
Q9Y2R2
Residue:
807
  
Inhibitor
Name:
BDBM61645
Synonyms:
3-[4-(5-Benzylidene-4-oxo-2-thioxo-thiazolidin-3-yl)-butyrylamino]-benzoic acid 3-[4-[(5E)-5-benzal-4-keto-2-thioxo-thiazolidin-3-yl]butanoylamino]benzoic acid 3-[[1-oxo-4-[(5E)-4-oxo-5-(phenylmethylene)-2-sulfanylidene-3-thiazolidinyl]butyl]amino]benzoic acid SMR000608141 | cid_1205881
Type:
Small organic molecule
Emp. Form.:
C21H18N2O4S2
Mol. Mass.:
426.509
SMILES:
OC(=O)c1cccc(NC(=O)CCCN2C(=S)S\C(=C\c3ccccc3)C2=O)c1
: