Target
Tyrosine-protein phosphatase non-receptor type 22
Ligand
BDBM58651
Substrate
Meas. Tech.
SAR LYP1 Fluorescent Assay using pCAP substrate for In Vitro dose response studies - Set 3
IC50
76000±n/a nM
Citation
 PubChem, PC SAR LYP1 Fluorescent Assay using pCAP substrate for In Vitro dose response studies - Set 3 PubChem Bioassay (2010)[AID] 
Target
Name:
Tyrosine-protein phosphatase non-receptor type 22
Synonyms:
3.1.3.48 LyP Lymphoid phosphatase (Lyp) PEST-domain phosphatase PTPN22 Tyrosine-protein phosphatase non-receptor type 22 (LYP) | tyrosine-protein phosphatase non-receptor type 22 isoform 1
Type:
Mol. Mass.:
91712.31
Organism:
Homo sapiens (Human)
Description:
Q9Y2R2
Residue:
807
  
Inhibitor
Name:
BDBM58651
Synonyms:
4-[4-[(5Z)-5-(4-ethylbenzylidene)-4-keto-2-thioxo-thiazolidin-3-yl]butanoylamino]benzoic acid 4-[4-[(5Z)-5-[(4-ethylphenyl)methylidene]-4-oxo-2-sulfanylidene-1,3-thiazolidin-3-yl]butanoylamino]benzoic acid MLS001075748 cid_1985027
Type:
Small organic molecule
Emp. Form.:
C23H22N2O4S2
Mol. Mass.:
454.562
SMILES:
CCc1ccc(\C=C2/SC(=S)N(CCCC(=O)Nc3ccc(cc3)C(O)=O)C2=O)cc1
: