Target
Dual specificity protein phosphatase 3
Ligand
BDBM75333
Substrate
Meas. Tech.
SAR analysis of compounds that inhibit VHR1, Fluorescent Assay - Set 2
IC50
>100000±n/a nM
Citation
 PubChem, PC SAR analysis of compounds that inhibit VHR1, Fluorescent Assay - Set 2 PubChem Bioassay (2010)[AID] 
Target
Name:
Dual specificity protein phosphatase 3
Synonyms:
DUS3_HUMAN Dual specificity protein phosphatase (VHR) Dual specificity protein phosphatase VHR Tyrosine-protein phosphatase non-receptor type 1 | VHR
Type:
Hydrolase
Mol. Mass.:
20480.58
Organism:
Homo sapiens (Human)
Description:
Residue:
185
  
Inhibitor
Name:
BDBM75333
Synonyms:
2-chloranyl-3-(2-phenyl-1,2,3,4-tetrazol-5-yl)quinoline 2-chloro-3-(2-phenyltetrazol-5-yl)quinoline cid_16066557
Type:
Small organic molecule
Emp. Form.:
C16H10ClN5
Mol. Mass.:
307.737
SMILES:
Clc1nc2ccccc2cc1-c1nnn(n1)-c1ccccc1
: