Target
Dual specificity protein phosphatase 3
Ligand
BDBM75366
Substrate
Meas. Tech.
SAR analysis of compounds that inhibit VHR1, Fluorescent Assay - Set 2
IC50
5310±n/a nM
Citation
 PubChem, PC SAR analysis of compounds that inhibit VHR1, Fluorescent Assay - Set 2 PubChem Bioassay (2010)[AID] 
Target
Name:
Dual specificity protein phosphatase 3
Synonyms:
DUS3_HUMAN Dual specificity protein phosphatase (VHR) Dual specificity protein phosphatase VHR Tyrosine-protein phosphatase non-receptor type 1 | VHR
Type:
Hydrolase
Mol. Mass.:
20480.58
Organism:
Homo sapiens (Human)
Description:
Residue:
185
  
Inhibitor
Name:
BDBM75366
Synonyms:
1-cyclopentyl-3-(4-sulfamoylphenyl)thiourea cid_892003
Type:
Small organic molecule
Emp. Form.:
C12H17N3O2S2
Mol. Mass.:
299.412
SMILES:
NS(=O)(=O)c1ccc(NC(=S)NC2CCCC2)cc1
: