Target
Tyrosine-protein phosphatase non-receptor type 7
Ligand
BDBM46242
Substrate
Meas. Tech.
SAR analysis of compounds that inhibit HePTP - Set 2
IC50
7010±n/a nM
Citation
 PubChem, PC SAR analysis of compounds that inhibit HePTP - Set 2 PubChem Bioassay (2010)[AID] 
Target
Name:
Tyrosine-protein phosphatase non-receptor type 7
Synonyms:
He-PTP Hematopoietic protein-tyrosine phosphatase (HEPTP) PTPN7 Tyrosine-protein phosphatase non-receptor type 7 | Tyrosine-protein phosphatase non-receptor type 7 (HEPTP)
Type:
Protein
Mol. Mass.:
40530.79
Organism:
Homo sapiens (Human)
Description:
P35236
Residue:
360
  
Inhibitor
Name:
BDBM46242
Synonyms:
4-[[4-[(Z)-2-cyano-2-(4-fluorophenyl)ethenyl]-2-methoxy-phenoxy]methyl]benzoic acid 4-[[4-[(Z)-2-cyano-2-(4-fluorophenyl)vinyl]-2-methoxy-phenoxy]methyl]benzoic acid cid_1282000
Type:
Small organic molecule
Emp. Form.:
C24H18FNO4
Mol. Mass.:
403.4024
SMILES:
COc1cc(\C=C(/C#N)c2ccc(F)cc2)ccc1OCc1ccc(cc1)C(O)=O
: